{"text_format":"1","workbook":"xlsx","n_sheets":4,"sheets":["Request Form","Request Form (Grant Summary)","Expense Code Summary","GT_Custom"],"not_rendered":{"charts":0,"images":6,"macros":1,"external_links":1,"defined_names":5,"comments":0,"pivot_tables":0},"unopened":[],"bounds":{"document_bytes":16777216,"sheet_cells":100000,"rows_first":2000,"rows_last":500,"rows_between":2000,"halvings":0,"cell_chars":16384,"cell_head_chars":4096},"cells_cut":0,"cells_raw":0,"read":"whole","date_system":"1900"}

{"sheet":"Request Form","index":0,"n_rows":133,"n_cols":19,"rows_kept":133,"cut":false,"hidden":false,"merged":[[0,7,0,14],[1,7,1,14],[11,3,11,4],[5,3,5,6],[7,3,7,6],[9,3,9,4],[3,3,3,6],[10,10,10,16],[3,9,3,14],[5,9,5,14],[9,9,9,14],[11,9,11,14],[13,9,13,14],[16,4,16,7],[18,4,18,7],[20,4,20,7],[98,1,98,9],[29,4,29,7],[31,4,31,7],[33,4,33,7],[35,4,35,7],[37,4,37,7],[39,4,39,7],[22,4,22,7],[24,4,24,7],[26,4,26,7]]}
[null,null,null,null,null,null,null,"Fund for Shared Insight"]
[null,null,null,null,null,null,null,"Payment Request Form"]
[]
[null,"Date:",null,null,null,null,null,"Submitted to:",null,"Michelle Mengel"]
[]
[null,"Submitted by:",null,null,null,null,null,"Payment total:",null,{"$f":"$Q$99","v":0}]
[]
[null,"Payee:",null,null,null,null,null,"Report Approvals"]
[]
[null,"New Payee?",null,null,null,null,null,"Project Approval:"]
[]
[null,"Employee?",null,"No",null,null,null,"RPA Approval:"]
[]
[null,null,null,null,null,null,null,"Date Approved:"]
[]
[null,"Payee Information",null,null,"Please complete the payee information section below."]
[null,"Contact:"]
[]
[null,"Title:"]
[]
[null,"Address:"]
[]
[]
[]
[null,"Phone:"]
[]
[null,"E-mail:"]
[]
[null,"Bank Information ",null,null,"Please complete the bank information section below."]
[null,"Account Name:"]
[]
[null,"Bank Name:"]
[]
[null,"Branch Address:"]
[]
[null,"Account Number:"]
[]
[null,"Routing Number: "]
[]
[null,"Swift Code:",null,null,null,null,null,null,null,"(Required for international transfers.)"]
[]
[null,"Expense Details"]
[]
[null,"Receipt #",null,"Date",null,"Business Purpose and Description",null,"Category",null,"Expense",null,"Project ID",null,null,"Revenue Source",null,"Amount",null,"Account Code - Project -Revenue Source"]
[null,null,null,null,null,null,null,"Select from list",null,null,null,"Select from list",null,null,"Select from list",null,null,null,"(Internal use only)"]
[null,null,null,null,null,null,null,"OTHER: Events"," ",{"$f":"IFERROR(INDEX('Expense Code Summary'!G$10:G$62,MATCH(H46,'Expense Code Summary'!F$10:F$62,0)),\"0000\")","v":7325},null,"6076-00 Fund for Shared Insight",{"$f":"LEFT(L46,7)","v":"6076-00"}," ","6076-Cohort3",null,null,null,{"$f":"IF(J46=\"0000\",\"  \",CONCATENATE(\"1\",\"-\",J46,\"-\",\"10\",\"  \",M46,\" \",IF(O46>1,CONCATENATE(\" \",O46,\" \"),\"\")))","v":"1-7325-10  6076-00  6076-Cohort3 "}]
[null,null,null,null,null,null,null,"OTHER: Events"," ",{"$f":"IFERROR(INDEX('Expense Code Summary'!G$10:G$62,MATCH(H47,'Expense Code Summary'!F$10:F$62,0)),\"0000\")","v":7325},null,"6076-00 Fund for Shared Insight",{"$f":"LEFT(L47,7)","v":"6076-00"}," ","6076-Cohort3",null,null,null,{"$f":"IF(J47=\"0000\",\"  \",CONCATENATE(\"1\",\"-\",J47,\"-\",\"10\",\"  \",M47,\" \",IF(O47>1,CONCATENATE(\" \",O47,\" \"),\"\")))","v":"1-7325-10  6076-00  6076-Cohort3 "}]
[null,null,null,null,null,null,null,"OTHER: Events"," ",{"$f":"IFERROR(INDEX('Expense Code Summary'!G$10:G$62,MATCH(H48,'Expense Code Summary'!F$10:F$62,0)),\"0000\")","v":7325},null,"6076-00 Fund for Shared Insight","6076-00"," ","6076-Cohort3",null,null,null,"1-7325-10  6076-00  6076-Cohort3 "]
[null,null,null,null,null,null,null,"OTHER: Events"," ",{"$f":"IFERROR(INDEX('Expense Code Summary'!G$10:G$62,MATCH(H49,'Expense Code Summary'!F$10:F$62,0)),\"0000\")","v":7325},null,"6076-00 Fund for Shared Insight","6076-00"," ","6076-Cohort3",null,null,null,"1-7325-10  6076-00  6076-Cohort3 "]
[null,null,null,null,null,null,null,"OTHER: Events"," ",{"$f":"IFERROR(INDEX('Expense Code Summary'!G$10:G$62,MATCH(H50,'Expense Code Summary'!F$10:F$62,0)),\"0000\")","v":7325},null,"6076-00 Fund for Shared Insight","6076-00"," ","6076-Cohort3",null,null,null,"1-7325-10  6076-00  6076-Cohort3 "]
[null,null,null,null,null,null,null,"OTHER: Events"," ",{"$f":"IFERROR(INDEX('Expense Code Summary'!G$10:G$62,MATCH(H51,'Expense Code Summary'!F$10:F$62,0)),\"0000\")","v":7325},null,"6076-00 Fund for Shared Insight","6076-00"," ","6076-Cohort3",null,null,null,"1-7325-10  6076-00  6076-Cohort3 "]
[null,null,null,null,null,null,null,"OTHER: Events"," ",{"$f":"IFERROR(INDEX('Expense Code Summary'!G$10:G$62,MATCH(H52,'Expense Code Summary'!F$10:F$62,0)),\"0000\")","v":7325},null,"6076-00 Fund for Shared Insight","6076-00"," ","6076-Cohort3",null,null,null,"1-7325-10  6076-00  6076-Cohort3 "]
[null,null,null,null,null,null,null,"OTHER: Events"," ",{"$f":"IFERROR(INDEX('Expense Code Summary'!G$10:G$62,MATCH(H53,'Expense Code Summary'!F$10:F$62,0)),\"0000\")","v":7325},null,"6076-00 Fund for Shared Insight","6076-00"," ","6076-Cohort3",null,null,null,"1-7325-10  6076-00  6076-Cohort3 "]
[null,null,null,null,null,null,null,"OTHER: Events"," ",{"$f":"IFERROR(INDEX('Expense Code Summary'!G$10:G$62,MATCH(H54,'Expense Code Summary'!F$10:F$62,0)),\"0000\")","v":7325},null,"6076-00 Fund for Shared Insight","6076-00"," ","6076-Cohort3",null,null,null,"1-7325-10  6076-00  6076-Cohort3 "]
[null,null,null,null,null,null,null,"OTHER: Events"," ",{"$f":"IFERROR(INDEX('Expense Code Summary'!G$10:G$62,MATCH(H55,'Expense Code Summary'!F$10:F$62,0)),\"0000\")","v":7325},null,"6076-00 Fund for Shared Insight","6076-00"," ","6076-Cohort3",null,null,null,"1-7325-10  6076-00  6076-Cohort3 "]
[null,null,null,null,null,null,null,"OTHER: Events"," ",{"$f":"IFERROR(INDEX('Expense Code Summary'!G$10:G$62,MATCH(H56,'Expense Code Summary'!F$10:F$62,0)),\"0000\")","v":7325},null,"6076-00 Fund for Shared Insight","6076-00"," ","6076-Cohort3",null,null,null,"1-7325-10  6076-00  6076-Cohort3 "]
[null,null,null,null,null,null,null,"OTHER: Events"," ",{"$f":"IFERROR(INDEX('Expense Code Summary'!G$10:G$62,MATCH(H57,'Expense Code Summary'!F$10:F$62,0)),\"0000\")","v":7325},null,"6076-00 Fund for Shared Insight","6076-00"," ","6076-Cohort3",null,null,null,"1-7325-10  6076-00  6076-Cohort3 "]
[null,null,null,null,null,null,null,"OTHER: Events"," ",{"$f":"IFERROR(INDEX('Expense Code Summary'!G$10:G$62,MATCH(H58,'Expense Code Summary'!F$10:F$62,0)),\"0000\")","v":7325},null,"6076-00 Fund for Shared Insight","6076-00"," ","6076-Cohort3",null,null,null,"1-7325-10  6076-00  6076-Cohort3 "]
[null,null,null,null,null,null,null,"OTHER: Events"," ",{"$f":"IFERROR(INDEX('Expense Code Summary'!G$10:G$62,MATCH(H59,'Expense Code Summary'!F$10:F$62,0)),\"0000\")","v":7325},null,"6076-00 Fund for Shared Insight","6076-00"," ","6076-Cohort3",null,null,null,"1-7325-10  6076-00  6076-Cohort3 "]
[null,null,null,null,null,null,null,"OTHER: Events"," ",{"$f":"IFERROR(INDEX('Expense Code Summary'!G$10:G$62,MATCH(H60,'Expense Code Summary'!F$10:F$62,0)),\"0000\")","v":7325},null,"6076-00 Fund for Shared Insight","6076-00"," ","6076-Cohort3",null,null,null,"1-7325-10  6076-00  6076-Cohort3 "]
{"$rows_left_out":74}
{"sheet":"Request Form (Grant Summary)","index":1,"n_rows":110,"n_cols":18,"rows_kept":110,"cut":false,"hidden":true,"merged":[[20,4,20,7],[3,3,3,6],[5,3,5,6],[5,11,5,15],[7,3,7,6],[7,11,7,15],[9,3,9,6],[9,11,9,15],[10,10,10,15],[11,3,11,4],[14,4,14,7],[16,4,16,7],[18,4,18,7],[108,4,109,7],[22,4,22,7],[24,4,24,7],[27,4,27,7],[29,4,29,7],[31,4,31,7],[33,4,33,7],[35,4,35,7],[37,4,37,7],[72,1,72,9],[102,4,103,7],[105,4,106,7]]}
[null,null,null,null,null,null,null,null,null,null,null,null,null,null,null,"Paymet Request Form"]
[]
[]
[null,"Date:"]
[]
[null,"Project:",null,null,null,null,null,null,"Project ID:",null,null,"1234"]
[]
[null,"Submitted by:",null,null,null,null,null,null,"Submitted to:"]
[]
[null,"Payee:",null,null,null,null,null,null,"Payment total:",null,null,{"$f":"$P$73","v":520}]
[]
[null,"New Payee?",null,"Yes"]
[]
[null,"Payee Information",null,null,"Please complete the payee information section below and submit a W9 form. "]
[null,"Contact:"]
[]
[null,"Title:"]
[]
[null,"Address:"]
[]
[]
[]
[null,"Phone:"]
[]
[null,"E-mail:"]
[]
[null,"Bank Information ",null,null,"Please complete the bank information section below."]
[null,"Account Name:"]
[]
[null,"Bank Name:"]
[]
[null,"Branch Address:"]
[]
[null,"Account Number:"]
[]
[null,"Routing Number: "]
[]
[null,"Swift Code:",null,null,null,null,null,null,null,"(Required for international transfers.)"]
[]
[null,"Expense Details"]
[]
[null,"Receipt #",null,"Date",null,"Description",null,"Category",null,"Expense",null,"Initiative",null,"Grant",null,"Amount",null,"Account Code"]
[null,null,null,null,null,null,null,"Select from list",null,null,null,"If applicable",null,"If applicable",null,null,null,"(Internal use only)"]
[null,"SAMPLE 1",null,"2015-02-05",null,null,null,"PROF: Communications ",null,{"$f":"IFERROR(INDEX('Expense Code Summary'!D4:D35,MATCH(H44,'Expense Code Summary'!$C$4:$C$35,0)),\"0000\")","v":"0000"},null,"0067",null,"0000",null,10,null,{"$f":"IF(J44=\"0000\",\" \",CONCATENATE(\"12\",\"-\",J44,\"-\",\"10\",\"-\",L44,\"-\",\"51\",IF(N44<>\"0000\",CONCATENATE(\" Grant \",N44,\" \"),\"\")))","v":" "}]
[null,"SAMPLE 2",null,"2015-02-05",null,null,null,"OP: T&E -- Travel",null,{"$f":"IFERROR(INDEX('Expense Code Summary'!D5:D36,MATCH(H45,'Expense Code Summary'!$C$4:$C$35,0)),\"0000\")","v":"0000"},null,"0000",null,"5657",null,100,null,{"$f":"IF(J45=\"0000\",\" \",CONCATENATE(\"12\",\"-\",J45,\"-\",\"10\",\"-\",L45,\"-\",\"51\",IF(N45<>\"0000\",CONCATENATE(\" Grant \",N45,\" \"),\"\")))","v":" "}]
[null,"SAMPLE 3",null,"2015-02-05",null,null,null,"PROF: IT Services",null,{"$f":"IFERROR(INDEX('Expense Code Summary'!D6:D37,MATCH(H46,'Expense Code Summary'!$C$4:$C$35,0)),\"0000\")","v":"0000"},null,"0000",null,"0000",null,150,null," "]
[null,"SAMPLE 4",null,"2015-02-05",null,null,null,"OP: T&E -- Meals & Entertainment",null,{"$f":"IFERROR(INDEX('Expense Code Summary'!D7:D38,MATCH(H47,'Expense Code Summary'!$C$4:$C$35,0)),\"0000\")","v":"0000"},null,"0067",null,"5656",null,60,null," "]
[null,"SAMPLE 5",null,"2015-02-05",null,null,null,"PROF: Software & Database Development",null,{"$f":"IFERROR(INDEX('Expense Code Summary'!D8:D39,MATCH(H48,'Expense Code Summary'!$C$4:$C$35,0)),\"0000\")","v":"0000"},null,"0067",null,"5656",null,200,null," "]
[null,null,null,null,null,null,null,null,null,{"$f":"IFERROR(INDEX('Expense Code Summary'!D9:D40,MATCH(H49,'Expense Code Summary'!$C$4:$C$35,0)),\"0000\")","v":"0000"},null,"0000",null,"0000",null,null,null," "]
[null,null,null,null,null,null,null,null,null,{"$f":"IFERROR(INDEX('Expense Code Summary'!D10:D41,MATCH(H50,'Expense Code Summary'!$C$4:$C$35,0)),\"0000\")","v":"0000"},null,"0000",null,"0000",null,null,null," "]
[null,null,null,null,null,null,null,null,null,{"$f":"IFERROR(INDEX('Expense Code Summary'!D11:D42,MATCH(H51,'Expense Code Summary'!$C$4:$C$35,0)),\"0000\")","v":"0000"},null,"0000",null,"0000",null,null,null," "]
[null,null,null,null,null,null,null,null,null,{"$f":"IFERROR(INDEX('Expense Code Summary'!D12:D43,MATCH(H52,'Expense Code Summary'!$C$4:$C$35,0)),\"0000\")","v":"0000"},null,"0000",null,"0000",null,null,null," "]
[null,null,null,null,null,null,null,null,null,{"$f":"IFERROR(INDEX('Expense Code Summary'!D13:D44,MATCH(H53,'Expense Code Summary'!$C$4:$C$35,0)),\"0000\")","v":"0000"},null,"0000",null,"0000",null,null,null," "]
[null,null,null,null,null,null,null,null,null,{"$f":"IFERROR(INDEX('Expense Code Summary'!D14:D45,MATCH(H54,'Expense Code Summary'!$C$4:$C$35,0)),\"0000\")","v":"0000"},null,"0000",null,"0000",null,null,null," "]
[null,null,null,null,null,null,null,null,null,{"$f":"IFERROR(INDEX('Expense Code Summary'!D15:D46,MATCH(H55,'Expense Code Summary'!$C$4:$C$35,0)),\"0000\")","v":"0000"},null,"0000",null,"0000",null,null,null," "]
[null,null,null,null,null,null,null,null,null,{"$f":"IFERROR(INDEX('Expense Code Summary'!D16:D47,MATCH(H56,'Expense Code Summary'!$C$4:$C$35,0)),\"0000\")","v":"0000"},null,"0000",null,"0000",null,null,null," "]
[null,null,null,null,null,null,null,null,null,{"$f":"IFERROR(INDEX('Expense Code Summary'!D17:D48,MATCH(H57,'Expense Code Summary'!$C$4:$C$35,0)),\"0000\")","v":"0000"},null,"0000",null,"0000",null,null,null," "]
[null,null,null,null,null,null,null,null,null,{"$f":"IFERROR(INDEX('Expense Code Summary'!D19:D50,MATCH(H58,'Expense Code Summary'!$C$4:$C$35,0)),\"0000\")","v":"0000"},null,"0000",null,"0000",null,null,null," "]
[null,null,null,null,null,null,null,null,null,{"$f":"IFERROR(INDEX('Expense Code Summary'!D5:D36,MATCH(H59,'Expense Code Summary'!$C$4:$C$35,0)),\"0000\")","v":"0000"},null,"0000",null,"0000",null,null,null," "]
[null,null,null,null,null,null,null,null,null,{"$f":"IFERROR(INDEX('Expense Code Summary'!D6:D37,MATCH(H60,'Expense Code Summary'!$C$4:$C$35,0)),\"0000\")","v":"0000"},null,"0000",null,"0000",null,null,null," "]
{"$rows_left_out":51}
{"sheet":"Expense Code Summary","index":2,"n_rows":62,"n_cols":15,"rows_kept":62,"cut":false,"hidden":false,"merged":[]}
[null,"Expense Codes"]
[null,"Key"]
[null,"OPS : Operations"]
[null,"FEES : Professional Fees"]
[null,"TRAV : Travel "]
[null,"OTHER : Other Activities",null,null,null,null,null,null,"Project ID",null,"Description",null,null,"Revenue source"]
[null,null,null,null,null,null,null,null,"6076-00"," ","Fund for Shared Insight",{"$f":"CONCATENATE(I7,J7,K7)","v":"6076-00 Fund for Shared Insight"}," ","6076-General","Fund for Shared Insight"]
[null,null,null,null,null,null,null,null,"6076-01"," ","Listen for Good",{"$f":"CONCATENATE(I8,J8,K8)","v":"6076-01 Listen for Good"}," ","6076-Listenfo","Listen for Good Grantmaking"]
[null,null,null,null,null,"Expense Type","Code",null,null,null,null,null,null,"6076-Cohort1","Cohort 1"]
[null,null,"OPS: ","Building Maintenance",null,{"$f":"CONCATENATE($C$10,D10)","v":"OPS: Building Maintenance"},6210,null,null,null,null,null,null,"6076-Cohort2","Cohort 2"]
[null,null,null,"Computer (Hardware) Expense",null,{"$f":"CONCATENATE($C$10,D11)","v":"OPS: Computer (Hardware) Expense"},6315,null,null,null,null,null,null,"6076-Cohort3","Cohort 3"]
[null,null,null,"Equipment Rental & Maintenance",null,"OPS: Equipment Rental & Maintenance",6230]
[null,null,null,"Express/Overnight Delivery",null,"OPS: Express/Overnight Delivery",6425]
[null,null,null,"Filing Fees",null,"OPS: Filing Fees",6054]
[null,null,null,"Housekeeping Supplies",null,"OPS: Housekeeping Supplies",6212]
[null,null,null,"Internal Corporate Events",null,"OPS: Internal Corporate Events",6410]
[null,null,null,"Internet Communications",null,"OPS: Internet Communications",6305]
[null,null,null,"Memberships, Dues and Registrations",null,"OPS: Memberships, Dues and Registrations",6050]
[null,null,null,"Office Equipment and Furniture",null,"OPS: Office Equipment and Furniture",6235]
[null,null,null,"Office Supplies",null,"OPS: Office Supplies",6400]
[null,null,null,"Organization Relocation Costs",null,"OPS: Organization Relocation Costs",6225]
[null,null,null,"Pantry Supplies",null,"OPS: Pantry Supplies",6405]
[null,null,null,"Postage",null,"OPS: Postage",6420]
[null,null,null,"Printing and Copying",null,"OPS: Printing and Copying",6415]
[null,null,null,"Professional Development including Conferences",null,"OPS: Professional Development including Conferences",5145]
[null,null,null,"Real Estate Taxes",null,"OPS: Real Estate Taxes",6215]
[null,null,null,"Rent",null,"OPS: Rent",6200]
[null,null,null,"Software Expense",null,"OPS: Software Expense",6320]
[null,null,null,"Storage",null,"OPS: Storage",6220]
[null,null,null,"Telecommunications",null,"OPS: Telecommunications",6300]
[null,null,null,"Utilities",null,"OPS: Utilities",6205]
[null,null,null,"Website Expense",null,"OPS: Website Expense",6310]
[null,null,"FEES: "," IT Consultant",null,{"$f":"CONCATENATE($C$33,D33)","v":"FEES:  IT Consultant"},6001]
[null,null,null,"Audit Fees",null,{"$f":"CONCATENATE($C$33,D34)","v":"FEES: Audit Fees"},6025]
[null,null,null,"Communications Consultant",null,"FEES: Communications Consultant",6003]
[null,null,null,"Consultant",null,"FEES: Consultant",6000]
[null,null,null,"Design Consultant",null,"FEES: Design Consultant",6002]
[null,null,null,"Evaluation Consultant",null,"FEES: Evaluation Consultant",6006]
[null,null,null,"Insurance",null,"FEES: Insurance",6080]
[null,null,null,"Investment Consultant",null,"FEES: Investment Consultant",6007]
[null,null,null,"Legal Fees",null,"FEES: Legal Fees",6020]
[null,null,null,"Organizational Dev Consultant",null,"FEES: Organizational Dev Consultant",6005]
[null,null,null,"Professional Fundraising Consultant",null,"FEES: Professional Fundraising Consultant",6008]
[null,null,null,"Recruiting Costs",null,"FEES: Recruiting Costs",6042]
[null,null,null,"Research Consultant",null,"FEES: Research Consultant",6004]
[null,null,null,"Temporary Employment",null,"FEES: Temporary Employment",6040]
[null,null,"TRAV: ","Local Travel and Meals",null,{"$f":"CONCATENATE($C$47,D47)","v":"TRAV: Local Travel and Meals"},7220]
[null,null,null,"Non-Staff Local Travel and Meals",null,{"$f":"CONCATENATE($C$47,D48)","v":"TRAV: Non-Staff Local Travel and Meals"},7221]
[null,null,null,"Non-Staff Travel - Accommodations",null,"TRAV: Non-Staff Travel - Accommodations",7206]
[null,null,null,"Non-Staff Travel - Meals & Incidentals",null,"TRAV: Non-Staff Travel - Meals & Incidentals",7211]
[null,null,null,"Non-Staff Travel - Transportation",null,"TRAV: Non-Staff Travel - Transportation",7201]
[null,null,null,"Travel - Accommodations",null,"TRAV: Travel - Accommodations",7205]
[null,null,null,"Travel - Meals & Incidentals",null,"TRAV: Travel - Meals & Incidentals",7210]
[null,null,null,"Travel - Transportation",null,"TRAV: Travel - Transportation",7200]
[null,null,"OTHER: ","Board Meeting Expense",null,{"$f":"CONCATENATE($C$55,D55)","v":"OTHER: Board Meeting Expense"},7250]
[null,null,null,"Business Meetings",null,{"$f":"CONCATENATE($C$55,D56)","v":"OTHER: Business Meetings"},7320]
[null,null,null,"Conferences (Sponsored Projects use only)",null,"OTHER: Conferences (Sponsored Projects use only)",7230]
[null,null,null,"Events",null,"OTHER: Events",7325]
[null,null,null,"Fundraising Expenses",null,"OTHER: Fundraising Expenses",7300]
[null,null,null,"Marketing and Public Relations",null,"OTHER: Marketing and Public Relations",7305]
{"$rows_left_out":3}
{"sheet":"GT_Custom","index":3,"n_rows":8,"n_cols":2,"rows_kept":8,"cut":false,"hidden":true,"merged":[]}
["C1","Custom 1"]
["C2","Custom 2"]
["C3","Custom 3"]
["C4","Custom 4"]
["C5","Custom 5"]
["C6","Custom 6"]
["C7","Custom 7"]
["C8","Custom 8"]